Reaction Details
TargetEukaryotic initiation factor 4A-I
LigandBDBM50235737
Substrate/Competitorn/a
Meas. Tech.ChEMBL_1657826 (CHEMBL4007296)
IC50>100000±n/a nM
Citation Ito, MIwatani, MKamada, YSogabe, SNakao, STanaka, TKawamoto, TAparicio, SNakanishi, AImaeda, Y Discovery of selective ATP-competitive eIF4A3 inhibitors. Bioorg Med Chem25:2200-2209 (2017) 
 
Eukaryotic initiation factor 4A-I
Name:Eukaryotic initiation factor 4A-I
Type:PROTEIN
Mol. Mass.:46146.87
Organism:Homo sapiens (Human)
Description:ChEMBL_864983
Residue:406
BDBM50235737
NameBDBM50235737
Synonyms:CHEMBL4070102
TypeSmall organic molecule
Emp. Form.C12H11ClFNO2
Mol. Mass.255.673
SMILESCC(C)c1cc(Cl)c2cc([nH]c2c1F)C(O)=O