Reaction Details
TargetCholinesterase
LigandBDBM50235805
Substrate/Competitorn/a
Meas. Tech.ChEMBL_1657927 (CHEMBL4007539)
IC50 108±n/a nM
Citation Wu, JTian, YWang, SPistolozzi, MJin, YZhou, TRoy, GXu, LTan, W Design, synthesis and biological evaluation of bambuterol analogues as novel inhibitors of butyrylcholinesterase. Eur J Med Chem126:61-71 (2017) 
 
Cholinesterase
Name:Cholinesterase
Type:Enzyme
Mol. Mass.:65643.35
Organism:Equus caballus (Horse)
Description:P81908
Residue:574
BDBM50235805
NameBDBM50235805
Synonyms:CHEMBL4100415
TypeSmall organic molecule
Emp. Form.C21H34ClN3O5
Mol. Mass.443.965
SMILESCl.CCN(C)C(=O)Oc1cc(OC(=O)N(C)CC)cc(c1)C(O)CN1CCCCC1