Reaction Details
TargetCholinesterase
LigandBDBM50235799
Substrate/Competitorn/a
Meas. Tech.ChEMBL_1657927 (CHEMBL4007539)
IC50 126±n/a nM
Citation Wu, JTian, YWang, SPistolozzi, MJin, YZhou, TRoy, GXu, LTan, W Design, synthesis and biological evaluation of bambuterol analogues as novel inhibitors of butyrylcholinesterase. Eur J Med Chem126:61-71 (2017) 
 
Cholinesterase
Name:Cholinesterase
Type:Enzyme
Mol. Mass.:65643.35
Organism:Equus caballus (Horse)
Description:P81908
Residue:574
BDBM50235799
NameBDBM50235799
Synonyms:CHEMBL4096024
TypeSmall organic molecule
Emp. Form.C19H32ClN3O5
Mol. Mass.417.927
SMILESCl.CCC(C)(C)NCC(O)c1cc(OC(=O)N(C)C)cc(OC(=O)N(C)C)c1