Reaction Details
TargetCholinesterase
LigandBDBM50235810
Substrate/Competitorn/a
Meas. Tech.ChEMBL_1657927 (CHEMBL4007539)
IC50 113±n/a nM
Citation Wu, JTian, YWang, SPistolozzi, MJin, YZhou, TRoy, GXu, LTan, W Design, synthesis and biological evaluation of bambuterol analogues as novel inhibitors of butyrylcholinesterase. Eur J Med Chem126:61-71 (2017) 
 
Cholinesterase
Name:Cholinesterase
Type:Enzyme
Mol. Mass.:65643.35
Organism:Equus caballus (Horse)
Description:P81908
Residue:574
BDBM50235810
NameBDBM50235810
Synonyms:CHEMBL4087355
TypeSmall organic molecule
Emp. Form.C20H34ClN3O5
Mol. Mass.431.954
SMILESCl.CCN(C)C(=O)Oc1cc(OC(=O)N(C)CC)cc(c1)C(O)CNC(C)(C)C