Reaction Details
TargetdCTP pyrophosphatase 1
LigandBDBM50236091
Substrate/Competitorn/a
Meas. Tech.ChEBML_1658761
IC50 208±n/a nM
Citation Llona-Minguez, SHöglund, AWiita, EAlmlöf, IMateus, ACalderón-Montaño, JMCazares-Körner, CHoman, ELoseva, OBaranczewski, PJemth, ASHäggblad, MMartens, ULundgren, BArtursson, PLundbäck, TJenmalm Jensen, AWarpman Berglund, UScobie, MHelleday, T Identification of Triazolothiadiazoles as Potent Inhibitors of the dCTP Pyrophosphatase 1. J Med Chem60:2148-2154 (2017) 
 
dCTP pyrophosphatase 1
Name:dCTP pyrophosphatase 1
Type:Protein
Mol. Mass.:18673.58
Organism:Homo sapiens (Human)
Description:Q9H773
Residue:170
BDBM50236091
NameBDBM50236091
Synonyms:CHEMBL4066177
TypeSmall organic molecule
Emp. Form.C16H11FN4OS
Mol. Mass.326.348
SMILESCOc1ccc(cc1)-c1nn2c(nnc2s1)-c1ccccc1F