Reaction Details
TargetDisintegrin and metalloproteinase domain-containing protein 17
LigandBDBM50236205
Substrate/Competitorn/a
Meas. Tech.ChEMBL_1658822 (CHEMBL4008434)
IC50 3.8±n/a nM
Citation Li, YGould, AAboye, TBi, TBreindel, LShekhtman, ACamarero, JA Full Sequence Amino Acid Scanning of¿-Defensin RTD-1 Yields a Potent Anthrax Lethal Factor Protease Inhibitor. J Med Chem60:1916-1927 (2017) 
 
Disintegrin and metalloproteinase domain-containing protein 17
Name:Disintegrin and metalloproteinase domain-containing protein 17
Type:Enzyme
Mol. Mass.:93007.89
Organism:Homo sapiens (Human)
Description:
Residue:824
BDBM50236205
NameBDBM50236205
Synonyms:CHEMBL4064688
TypeSmall organic molecule
Emp. Form.C88H138N34O19S6
Mol. Mass.2168.644
SMILESCC[C@H](C)[C@@H]1NC(=O)[C@@H]2CSSC[C@H](NC(=O)[C@H](CCCNC(N)=N)NC(=O)[C@@H]3CSSC[C@H](NC1=O)C(=O)N[C@@H]([C@@H](C)O)C(=O)N[C@@H](CCCNC(N)=N)C(=O)NCC(=O)N[C@@H](Cc1ccccc1)C(=O)N3)C(=O)N[C@@H](CC(C)C)C(=O)N[C@H]1CSSC[C@H](NC(=O)[C@H](Cc3c[nH]c4ccccc34)NC(=O)CNC(=O)[C@H](CCCNC(N)=N)NC(=O)[C@H](CCCNC(N)=N)NC1=O)C(=O)N[C@@H](CCCNC(N)=N)C(=O)N2