Reaction Details
TargetHeat shock protein HSP 90-alpha
LigandBDBM50236526
Substrate/Competitorn/a
Meas. Tech.ChEMBL_1659253 (CHEMBL4008865)
Ki 1230±n/a nM
Citation Brough, PABaker, LBedford, SBrown, KChavda, SChell, VD'Alessandro, JDavies, NGDavis, BLe Strat, LMacias, ATMaddox, DMahon, PCMassey, AJMatassova, NMcKenna, SMeissner, JWMoore, JDMurray, JBNorthfield, CJParry, CParsons, RRoughley, SDShaw, TSimmonite, HStokes, SSurgenor, AStefaniak, ERobertson, AWang, YWebb, PWhitehead, NWood, M Application of Off-Rate Screening in the Identification of Novel Pan-Isoform Inhibitors of Pyruvate Dehydrogenase Kinase. J Med Chem60:2271-2286 (2017) 
 
Heat shock protein HSP 90-alpha
Name:Heat shock protein HSP 90-alpha
Type:Molecular Chaperone
Mol. Mass.:84623.45
Organism:Homo sapiens (Human)
Description:P07900
Residue:732
BDBM50236526
NameBDBM50236526
Synonyms:CHEMBL4089806
TypeSmall organic molecule
Emp. Form.C17H18N2O4
Mol. Mass.314.3358
SMILESCN(C)C(=O)c1ccc(cc1)N(C)C(=O)c1ccc(O)cc1O