Reaction Details
TargetHeat shock protein HSP 90-alpha
LigandBDBM50236511
Substrate/Competitorn/a
Meas. Tech.ChEMBL_1659253 (CHEMBL4008865)
Ki 2510±n/a nM
Citation Brough, PABaker, LBedford, SBrown, KChavda, SChell, VD'Alessandro, JDavies, NGDavis, BLe Strat, LMacias, ATMaddox, DMahon, PCMassey, AJMatassova, NMcKenna, SMeissner, JWMoore, JDMurray, JBNorthfield, CJParry, CParsons, RRoughley, SDShaw, TSimmonite, HStokes, SSurgenor, AStefaniak, ERobertson, AWang, YWebb, PWhitehead, NWood, M Application of Off-Rate Screening in the Identification of Novel Pan-Isoform Inhibitors of Pyruvate Dehydrogenase Kinase. J Med Chem60:2271-2286 (2017) 
 
Heat shock protein HSP 90-alpha
Name:Heat shock protein HSP 90-alpha
Type:Molecular Chaperone
Mol. Mass.:84623.45
Organism:Homo sapiens (Human)
Description:P07900
Residue:732
BDBM50236511
NameBDBM50236511
Synonyms:CHEMBL3718319
TypeSmall organic molecule
Emp. Form.C28H26N4O4
Mol. Mass.482.5304
SMILESC[C@H]1CCc2cc(ccc2N1C(=O)c1ccc(O)cc1O)C(=O)N(C)Cc1ccc2nccnc2c1