Reaction Details
Target[Pyruvate dehydrogenase (acetyl-transferring)] kinase isozyme 1, mitochondrial
LigandBDBM50236517
Substrate/Competitorn/a
Meas. Tech.ChEMBL_1659262 (CHEMBL4008874)
IC50 10600±n/a nM
Citation Brough, PABaker, LBedford, SBrown, KChavda, SChell, VD'Alessandro, JDavies, NGDavis, BLe Strat, LMacias, ATMaddox, DMahon, PCMassey, AJMatassova, NMcKenna, SMeissner, JWMoore, JDMurray, JBNorthfield, CJParry, CParsons, RRoughley, SDShaw, TSimmonite, HStokes, SSurgenor, AStefaniak, ERobertson, AWang, YWebb, PWhitehead, NWood, M Application of Off-Rate Screening in the Identification of Novel Pan-Isoform Inhibitors of Pyruvate Dehydrogenase Kinase. J Med Chem60:2271-2286 (2017) 
 
[Pyruvate dehydrogenase (acetyl-transferring)] kinase isozyme 1, mitochondrial
Name:[Pyruvate dehydrogenase (acetyl-transferring)] kinase isozyme 1, mitochondrial
Type:Protein
Mol. Mass.:49255.23
Organism:Homo sapiens (Human)
Description:Q15118
Residue:436
BDBM50236517
NameBDBM50236517
Synonyms:CHEMBL3732579
TypeSmall organic molecule
Emp. Form.C30H28N2O5
Mol. Mass.496.5537
SMILESCOc1ccc(CN(C)C(=O)c2ccc(cc2)N(Cc2ccccc2)C(=O)c2ccc(O)cc2O)cc1