Reaction Details
TargetMetabotropic glutamate receptor 5
LigandBDBM50084137
Substrate/Competitorn/a
Meas. Tech.ChEBML_1659333
Ki 9.6±n/a nM
Citation Galambos, JBielik, AKrasavin, MOrgován, ZDomány, GNógrádi, KWágner, GBalogh, GTBéni, ZKóti, JSzakács, ZBobok, AKolok, SMikó-Bakk, MLVastag, MSághy, KLaszy, JHalász, ASBalázs, OGál, KGreiner, ISzombathelyi, ZKeseru, GM Discovery and Preclinical Characterization of 3-((4-(4-Chlorophenyl)-7-fluoroquinoline-3-yl)sulfonyl)benzonitrile, a Novel Non-acetylenic Metabotropic Glutamate Receptor 5 (mGluR5) Negative Allosteric Modulator for Psychiatric Indications. J Med Chem60:2470-2484 (2017) 
 
Metabotropic glutamate receptor 5
Name:Metabotropic glutamate receptor 5
Type:Enzyme
Mol. Mass.:131900.14
Organism:Rattus norvegicus (Rat)
Description:P31424
Residue:1203
BDBM50084137
NameBDBM50084137
Synonyms:2-Methyl-6-(phenylethynyl)pyridine 2-Methyl-6-phenylethynyl-pyridine(MPEP) 2-methyl-6-(phenyl-ethynyl)pyridine 6-methyl-2-(2-phenylethynyl)pyridine CHEMBL66654 US10618900, No. MPEP | [3H]-2-methyl-6-(phenylethynyl)-pyridine
TypeSmall organic molecule
Emp. Form.C14H11N
Mol. Mass.193.2438
SMILESCc1cccc(n1)C#Cc1ccccc1