Reaction Details
TargetD(2) dopamine receptor
LigandBDBM50236740
Substrate/Competitorn/a
Meas. Tech.ChEMBL_1660541 (CHEMBL4010153)
Ki 0.700000±n/a nM
Citation Möller, DBanerjee, AUzuneser, TCSkultety, MHuth, TPlouffe, BHübner, HAlzheimer, CFriedland, KMüller, CPBouvier, MGmeiner, P Discovery of G Protein-Biased Dopaminergics with a Pyrazolo[1,5-a]pyridine Substructure. J Med Chem60:2908-2929 (2017) 
 
D(2) dopamine receptor
Name:D(2) dopamine receptor
Type:Cell-surface receptors
Mol. Mass.:50647.10
Organism:Homo sapiens (Human)
Description:P14416
Residue:443
BDBM50236740
NameBDBM50236740
Synonyms:CHEMBL4078348
TypeSmall organic molecule
Emp. Form.C24H31N3O2
Mol. Mass.393.5218
SMILESCCCN(CCCCOc1ccn2nccc2c1)[C@H]1CCc2c(O)cccc2C1