Reaction Details
TargetD(2) dopamine receptor
LigandBDBM50236965
Substrate/Competitorn/a
Meas. Tech.ChEMBL_1660541 (CHEMBL4010153)
Ki 1.7±n/a nM
Citation Möller, DBanerjee, AUzuneser, TCSkultety, MHuth, TPlouffe, BHübner, HAlzheimer, CFriedland, KMüller, CPBouvier, MGmeiner, P Discovery of G Protein-Biased Dopaminergics with a Pyrazolo[1,5-a]pyridine Substructure. J Med Chem60:2908-2929 (2017) 
 
D(2) dopamine receptor
Name:D(2) dopamine receptor
Type:Cell-surface receptors
Mol. Mass.:50647.10
Organism:Homo sapiens (Human)
Description:P14416
Residue:443
BDBM50236965
NameBDBM50236965
Synonyms:CHEMBL4069145
TypeSmall organic molecule
Emp. Form.C23H29N5O3
Mol. Mass.423.5081
SMILESCOc1ccccc1N1CCN(CCCCOc2ccc3c(\C=N\O)cnn3c2)CC1