Reaction Details
TargetD(1A) dopamine receptor
LigandBDBM50237164
Substrate/Competitorn/a
Meas. Tech.ChEBML_1660542
Ki 250±n/a nM
Citation Möller, DBanerjee, AUzuneser, TCSkultety, MHuth, TPlouffe, BHübner, HAlzheimer, CFriedland, KMüller, CPBouvier, MGmeiner, P Discovery of G Protein-Biased Dopaminergics with a Pyrazolo[1,5-a]pyridine Substructure. J Med Chem60:2908-2929 (2017) 
 
D(1A) dopamine receptor
Name:D(1A) dopamine receptor
Type:Enzyme
Mol. Mass.:49303.43
Organism:Homo sapiens (Human)
Description:P21728
Residue:446
BDBM50237164
NameBDBM50237164
Synonyms:CHEMBL4091064
TypeSmall organic molecule
Emp. Form.C22H22Cl2N6O
Mol. Mass.457.356
SMILESClc1cccc(N2CCN(CCCC(=O)Nc3ccn4ncc(C#N)c4c3)CC2)c1Cl