Reaction Details
TargetD(2) dopamine receptor
LigandBDBM50237162
Substrate/Competitorn/a
Meas. Tech.ChEMBL_1660541 (CHEMBL4010153)
Ki 0.900000±n/a nM
Citation Möller, DBanerjee, AUzuneser, TCSkultety, MHuth, TPlouffe, BHübner, HAlzheimer, CFriedland, KMüller, CPBouvier, MGmeiner, P Discovery of G Protein-Biased Dopaminergics with a Pyrazolo[1,5-a]pyridine Substructure. J Med Chem60:2908-2929 (2017) 
 
D(2) dopamine receptor
Name:D(2) dopamine receptor
Type:Cell-surface receptors
Mol. Mass.:50647.10
Organism:Homo sapiens (Human)
Description:P14416
Residue:443
BDBM50237162
NameBDBM50237162
Synonyms:CHEMBL4090208
TypeSmall organic molecule
Emp. Form.C25H31N3O3
Mol. Mass.421.5319
SMILESCCCN(CCCCOc1ccn2ncc(C=O)c2c1)[C@H]1CCc2c(O)cccc2C1