Reaction Details
TargetD(2) dopamine receptor
LigandBDBM50236956
Substrate/Competitorn/a
Meas. Tech.ChEMBL_1660544 (CHEMBL4010156)
Ki 0.570000±n/a nM
Citation Möller, DBanerjee, AUzuneser, TCSkultety, MHuth, TPlouffe, BHübner, HAlzheimer, CFriedland, KMüller, CPBouvier, MGmeiner, P Discovery of G Protein-Biased Dopaminergics with a Pyrazolo[1,5-a]pyridine Substructure. J Med Chem60:2908-2929 (2017) 
 
D(2) dopamine receptor
Name:D(2) dopamine receptor
Type:Cell-surface receptors
Mol. Mass.:50647.10
Organism:Homo sapiens (Human)
Description:P14416
Residue:443
BDBM50236956
NameBDBM50236956
Synonyms:CHEMBL4069091
TypeSmall organic molecule
Emp. Form.C22H24Cl2N6O2
Mol. Mass.475.371
SMILESO\N=C/c1cnn2ccc(NC(=O)CCCN3CCN(CC3)c3cccc(Cl)c3Cl)cc12