Reaction Details
TargetD(2) dopamine receptor
LigandBDBM50236962
Substrate/Competitorn/a
Meas. Tech.ChEMBL_1660541 (CHEMBL4010153)
Ki 0.520000±n/a nM
Citation Möller, DBanerjee, AUzuneser, TCSkultety, MHuth, TPlouffe, BHübner, HAlzheimer, CFriedland, KMüller, CPBouvier, MGmeiner, P Discovery of G Protein-Biased Dopaminergics with a Pyrazolo[1,5-a]pyridine Substructure. J Med Chem60:2908-2929 (2017) 
 
D(2) dopamine receptor
Name:D(2) dopamine receptor
Type:Cell-surface receptors
Mol. Mass.:50647.10
Organism:Homo sapiens (Human)
Description:P14416
Residue:443
BDBM50236962
NameBDBM50236962
Synonyms:CHEMBL4096353
TypeSmall organic molecule
Emp. Form.C23H28N6O3
Mol. Mass.436.5068
SMILESCOc1ccccc1N1CCN(CCCC(=O)Nc2ccn3ncc(\C=N/O)c3c2)CC1