Reaction Details
TargetCytochrome P450 1A1
LigandBDBM50237137
Substrate/Competitorn/a
Meas. Tech.ChEMBL_1659861 (CHEMBL4009473)
IC50 58±n/a nM
Citation Horley, NJBeresford, KJChawla, TMcCann, GJRuparelia, KCGatchie, LSonawane, VRWilliams, ISTan, HLJoshi, PBharate, SSKumar, VBharate, SBChaudhuri, B Discovery and characterization of novel CYP1B1 inhibitors based on heterocyclic chalcones: Overcoming cisplatin resistance in CYP1B1-overexpressing lines. Eur J Med Chem129:159-174 (2017) 
 
Cytochrome P450 1A1
Name:Cytochrome P450 1A1
Type:Protein
Mol. Mass.:58177.23
Organism:Homo sapiens (Human)
Description:P04798
Residue:512
BDBM50237137
NameBDBM50237137
Synonyms:CHEMBL4098125
TypeSmall organic molecule
Emp. Form.C22H15NO
Mol. Mass.309.3606
SMILESO=C(\C=C\c1cccnc1)c1cc2ccccc2c2ccccc12