Reaction Details
TargetEphrin type-A receptor 3
LigandBDBM50334268
Substrate/Competitorn/a
Meas. Tech.ChEMBL_1661525 (CHEMBL4011137)
IC50<19953±n/a nM
Citation Gibson, TSJohnson, BFanjul, AHalkowycz, PDougan, DRCole, DSwann, S Structure-based drug design of novel ASK1 inhibitors using an integrated lead optimization strategy. Bioorg Med Chem Lett27:1709-1713 (2017) 
 
Ephrin type-A receptor 3
Name:Ephrin type-A receptor 3
Type:Protein
Mol. Mass.:110131.95
Organism:Homo sapiens (Human)
Description:P29320
Residue:983
BDBM50334268
NameBDBM50334268
Synonyms:CHEMBL1642655 N-(6-(1H-imidazol-1-yl)imidazo[1,2-a]pyridin-2-yl)-4-tert-butylbenzamide
TypeSmall organic molecule
Emp. Form.C21H21N5O
Mol. Mass.359.4243
SMILESCC(C)(C)c1ccc(cc1)C(=O)Nc1cn2cc(ccc2n1)-n1ccnc1