Reaction Details
TargetMitogen-activated protein kinase kinase kinase 5
LigandBDBM50237294
Substrate/Competitorn/a
Meas. Tech.ChEMBL_1661517 (CHEMBL4011129)
EC50 140±n/a nM
Citation Gibson, TSJohnson, BFanjul, AHalkowycz, PDougan, DRCole, DSwann, S Structure-based drug design of novel ASK1 inhibitors using an integrated lead optimization strategy. Bioorg Med Chem Lett27:1709-1713 (2017) 
 
Mitogen-activated protein kinase kinase kinase 5
Name:Mitogen-activated protein kinase kinase kinase 5
Type:Protein
Mol. Mass.:154514.93
Organism:Homo sapiens (Human)
Description:Q99683
Residue:1374
BDBM50237294
NameBDBM50237294
Synonyms:CHEMBL4064613
TypeSmall organic molecule
Emp. Form.C17H20N6O3S
Mol. Mass.388.444
SMILESCOCCOc1ccnc(NC(=O)c2csc(n2)-c2nncn2C(C)C)c1