Reaction Details
TargetEstrogen receptor
LigandBDBM20608
Substrate/Competitorn/a
Meas. Tech.ChEMBL_1661537 (CHEMBL4011149)
IC50 3.0±n/a nM
Citation Burks, HEAbrams, TKirby, CABaird, JFekete, AHamann, LGKim, SLombardo, FLoo, ALubicka, DMacchi, KMcDonnell, DPMishina, YNorris, JDNunez, JSaran, CSun, YThomsen, NMWang, CWang, JPeukert, S Discovery of an Acrylic Acid Based Tetrahydroisoquinoline as an Orally Bioavailable Selective Estrogen Receptor Degrader for ERa+ Breast Cancer. J Med Chem60:2790-2818 (2017) 
 
Estrogen receptor
Name:Estrogen receptor
Type:Protein
Mol. Mass.:66230.44
Organism:Homo sapiens (Human)
Description:P03372
Residue:595
BDBM20608
NameBDBM20608
Synonyms:4-Hydroxytamoxifen 4-[(1Z)-1-{4-[2-(dimethylamino)ethoxy]phenyl}-2-phenylbut-1-en-1-yl]phenol CHEMBL489 cid_449459
TypeSmall organic molecule
Emp. Form.C26H29NO2
Mol. Mass.387.514
SMILESCC\C(=C(/c1ccc(O)cc1)c1ccc(OCCN(C)C)cc1)c1ccccc1