Reaction Details
TargetCarbonic anhydrase 1
LigandBDBM50237363
Substrate/Competitorn/a
Meas. Tech.ChEBML_1660851
Ki 48±n/a nM
Citation Carta, FBirkmann, APfaff, TBuschmann, HSchwab, WZimmermann, HMaresca, ASupuran, CT Lead Development of Thiazolylsulfonamides with Carbonic Anhydrase Inhibitory Action. J Med Chem60:3154-3164 (2017) 
 
Carbonic anhydrase 1
Name:Carbonic anhydrase 1
Type:Enzyme
Mol. Mass.:28873.37
Organism:Homo sapiens (Human)
Description:P00915
Residue:261
BDBM50237363
NameBDBM50237363
Synonyms:CHEMBL4100366
TypeSmall organic molecule
Emp. Form.C19H20N4O3S2
Mol. Mass.416.517
SMILESCCc1nc(sc1S(N)(=O)=O)N(C)C(=O)Cc1ccc(cc1)-c1ccccn1