Reaction Details
TargetCarbonic anhydrase 2
LigandBDBM50237372
Substrate/Competitorn/a
Meas. Tech.ChEBML_1660852
Ki 33±n/a nM
Citation Carta, FBirkmann, APfaff, TBuschmann, HSchwab, WZimmermann, HMaresca, ASupuran, CT Lead Development of Thiazolylsulfonamides with Carbonic Anhydrase Inhibitory Action. J Med Chem60:3154-3164 (2017) 
 
Carbonic anhydrase 2
Name:Carbonic anhydrase 2
Type:Enzyme
Mol. Mass.:29250.71
Organism:Homo sapiens (Human)
Description:P00918
Residue:260
BDBM50237372
NameBDBM50237372
Synonyms:CHEMBL4089153
TypeSmall organic molecule
Emp. Form.C20H20FN3O4S2
Mol. Mass.449.519
SMILESCOc1c(F)cccc1-c1ccc(CC(=O)N(C)c2nc(C)c(s2)S(N)(=O)=O)cc1