Reaction Details
TargetCarbonic anhydrase 2
LigandBDBM50237363
Substrate/Competitorn/a
Meas. Tech.ChEBML_1660852
Ki 1.000000±n/a nM
Citation Carta, FBirkmann, APfaff, TBuschmann, HSchwab, WZimmermann, HMaresca, ASupuran, CT Lead Development of Thiazolylsulfonamides with Carbonic Anhydrase Inhibitory Action. J Med Chem60:3154-3164 (2017) 
 
Carbonic anhydrase 2
Name:Carbonic anhydrase 2
Type:Enzyme
Mol. Mass.:29250.71
Organism:Homo sapiens (Human)
Description:P00918
Residue:260
BDBM50237363
NameBDBM50237363
Synonyms:CHEMBL4100366
TypeSmall organic molecule
Emp. Form.C19H20N4O3S2
Mol. Mass.416.517
SMILESCCc1nc(sc1S(N)(=O)=O)N(C)C(=O)Cc1ccc(cc1)-c1ccccn1