Reaction Details
TargetCarbonic anhydrase 9
LigandBDBM50237369
Substrate/Competitorn/a
Meas. Tech.ChEMBL_1660855 (CHEMBL4010467)
Ki 1±n/a nM
Citation Carta, FBirkmann, APfaff, TBuschmann, HSchwab, WZimmermann, HMaresca, ASupuran, CT Lead Development of Thiazolylsulfonamides with Carbonic Anhydrase Inhibitory Action. J Med Chem60:3154-3164 (2017) 
 
Carbonic anhydrase 9
Name:Carbonic anhydrase 9
Type:Enzyme
Mol. Mass.:49669.03
Organism:Homo sapiens (Human)
Description:Catalytic domain of human cloned isozyme was used in the assay
Residue:459
BDBM50237369
NameBDBM50237369
Synonyms:CHEMBL4084758
TypeSmall organic molecule
Emp. Form.C21H21N3O3S2
Mol. Mass.427.54
SMILESCc1nc(sc1S(N)(=O)=O)N(C1CC1)C(=O)Cc1ccc(cc1)-c1ccccc1