Reaction Details
TargetCarbonic anhydrase 5A, mitochondrial
LigandBDBM50237498
Substrate/Competitorn/a
Meas. Tech.ChEMBL_1660853 (CHEMBL4010465)
Ki 29±n/a nM
Citation Carta, FBirkmann, APfaff, TBuschmann, HSchwab, WZimmermann, HMaresca, ASupuran, CT Lead Development of Thiazolylsulfonamides with Carbonic Anhydrase Inhibitory Action. J Med Chem60:3154-3164 (2017) 
 
Carbonic anhydrase 5A, mitochondrial
Name:Carbonic anhydrase 5A, mitochondrial
Type:Enzyme
Mol. Mass.:34755.54
Organism:Homo sapiens (Human)
Description:Human (cloned) isozyme
Residue:305
BDBM50237498
NameBDBM50237498
Synonyms:CHEMBL4063105
TypeSmall organic molecule
Emp. Form.C22H26N4O3S2
Mol. Mass.458.597
SMILESCN(C)CCN(C(=O)Cc1ccc(cc1)-c1ccccc1)c1nc(C)c(s1)S(N)(=O)=O