Reaction Details
TargetCarbonic anhydrase 2
LigandBDBM50237495
Substrate/Competitorn/a
Meas. Tech.ChEMBL_1660852 (CHEMBL4010464)
Ki 104±n/a nM
Citation Carta, FBirkmann, APfaff, TBuschmann, HSchwab, WZimmermann, HMaresca, ASupuran, CT Lead Development of Thiazolylsulfonamides with Carbonic Anhydrase Inhibitory Action. J Med Chem60:3154-3164 (2017) 
 
Carbonic anhydrase 2
Name:Carbonic anhydrase 2
Type:Enzyme
Mol. Mass.:29250.71
Organism:Homo sapiens (Human)
Description:P00918
Residue:260
BDBM50237495
NameBDBM50237495
Synonyms:CHEMBL4092504
TypeSmall organic molecule
Emp. Form.C19H18FN3O3S2
Mol. Mass.419.493
SMILESCN(C(=O)Cc1ccc(cc1)-c1cccc(F)c1)c1nc(C)c(s1)S(N)(=O)=O