Reaction Details
TargetSphingosine kinase 1
LigandBDBM50237429
Substrate/Competitorn/a
Meas. Tech.ChEMBL_1660110 (CHEMBL4009722)
IC50 290±n/a nM
Citation Schnute, MEMcReynolds, MDCarroll, JChrencik, JHighkin, MKIyanar, KJerome, GRains, JWSaabye, MScholten, JAYates, MNagiec, MM Discovery of a Potent and Selective Sphingosine Kinase 1 Inhibitor through the Molecular Combination of Chemotype-Distinct Screening Hits. J Med Chem60:2562-2572 (2017) 
 
Sphingosine kinase 1
Name:Sphingosine kinase 1
Type:Enzyme
Mol. Mass.:42521.16
Organism:Homo sapiens (Human)
Description:Q9NYA1
Residue:384
BDBM50237429
NameBDBM50237429
Synonyms:CHEMBL4066355
TypeSmall organic molecule
Emp. Form.C24H31N3O
Mol. Mass.377.5224
SMILESCC(C)Cn1c(C)nc2ccc(cc12)-c1ccc(CN2CCC[C@@H]2CO)cc1