Reaction Details
TargetSphingosine kinase 1
LigandBDBM50237432
Substrate/Competitorn/a
Meas. Tech.ChEMBL_1660110 (CHEMBL4009722)
IC50 439±n/a nM
Citation Schnute, MEMcReynolds, MDCarroll, JChrencik, JHighkin, MKIyanar, KJerome, GRains, JWSaabye, MScholten, JAYates, MNagiec, MM Discovery of a Potent and Selective Sphingosine Kinase 1 Inhibitor through the Molecular Combination of Chemotype-Distinct Screening Hits. J Med Chem60:2562-2572 (2017) 
 
Sphingosine kinase 1
Name:Sphingosine kinase 1
Type:Enzyme
Mol. Mass.:42521.16
Organism:Homo sapiens (Human)
Description:Q9NYA1
Residue:384
BDBM50237432
NameBDBM50237432
Synonyms:CHEMBL4093845
TypeSmall organic molecule
Emp. Form.C21H27NO4S
Mol. Mass.389.508
SMILESCS(=O)(=O)Cc1cccc(OCc2ccc(CN3CCC[C@@H]3CO)cc2)c1