Reaction Details
TargetSphingosine kinase 2
LigandBDBM50041978
Substrate/Competitorn/a
Meas. Tech.ChEMBL_1660111 (CHEMBL4009723)
IC50 356±n/a nM
Citation Schnute, MEMcReynolds, MDCarroll, JChrencik, JHighkin, MKIyanar, KJerome, GRains, JWSaabye, MScholten, JAYates, MNagiec, MM Discovery of a Potent and Selective Sphingosine Kinase 1 Inhibitor through the Molecular Combination of Chemotype-Distinct Screening Hits. J Med Chem60:2562-2572 (2017) 
 
Sphingosine kinase 2
Name:Sphingosine kinase 2
Type:Protein
Mol. Mass.:69221.44
Organism:Homo sapiens (Human)
Description:Q9NRA0
Residue:654
BDBM50041978
NameBDBM50041978
Synonyms:CHEMBL3134157
TypeSmall organic molecule
Emp. Form.C27H31NO4S
Mol. Mass.465.604
SMILESCc1cc(CS(=O)(=O)c2ccccc2)cc(OCc2ccc(CN3CCC[C@@H]3CO)cc2)c1