Reaction Details
TargetSphingosine kinase 2
LigandBDBM50237421
Substrate/Competitorn/a
Meas. Tech.ChEMBL_1660111 (CHEMBL4009723)
IC50 164±n/a nM
Citation Schnute, MEMcReynolds, MDCarroll, JChrencik, JHighkin, MKIyanar, KJerome, GRains, JWSaabye, MScholten, JAYates, MNagiec, MM Discovery of a Potent and Selective Sphingosine Kinase 1 Inhibitor through the Molecular Combination of Chemotype-Distinct Screening Hits. J Med Chem60:2562-2572 (2017) 
 
Sphingosine kinase 2
Name:Sphingosine kinase 2
Type:Protein
Mol. Mass.:69221.44
Organism:Homo sapiens (Human)
Description:Q9NRA0
Residue:654
BDBM50237421
NameBDBM50237421
Synonyms:CHEMBL4069327
TypeSmall organic molecule
Emp. Form.C23H29NO4S
Mol. Mass.415.546
SMILESOC[C@H]1CCCN1Cc1ccc(COc2cccc(CS(=O)(=O)C3CC3)c2)cc1