Reaction Details
TargetSphingosine kinase 1
LigandBDBM50237436
Substrate/Competitorn/a
Meas. Tech.ChEMBL_1660112 (CHEMBL4009724)
IC50 4.0±n/a nM
Citation Schnute, MEMcReynolds, MDCarroll, JChrencik, JHighkin, MKIyanar, KJerome, GRains, JWSaabye, MScholten, JAYates, MNagiec, MM Discovery of a Potent and Selective Sphingosine Kinase 1 Inhibitor through the Molecular Combination of Chemotype-Distinct Screening Hits. J Med Chem60:2562-2572 (2017) 
 
Sphingosine kinase 1
Name:Sphingosine kinase 1
Type:Enzyme
Mol. Mass.:42521.16
Organism:Homo sapiens (Human)
Description:Q9NYA1
Residue:384
BDBM50237436
NameBDBM50237436
Synonyms:CHEMBL4086161
TypeSmall organic molecule
Emp. Form.C25H33N3O
Mol. Mass.391.549
SMILESCC(C)CCn1c(C)nc2ccc(cc12)-c1ccc(CN2CCC[C@@H]2CO)cc1