Reaction Details
TargetSphingosine kinase 1
LigandBDBM50237423
Substrate/Competitorn/a
Meas. Tech.ChEMBL_1660112 (CHEMBL4009724)
IC50 1.7±n/a nM
Citation Schnute, MEMcReynolds, MDCarroll, JChrencik, JHighkin, MKIyanar, KJerome, GRains, JWSaabye, MScholten, JAYates, MNagiec, MM Discovery of a Potent and Selective Sphingosine Kinase 1 Inhibitor through the Molecular Combination of Chemotype-Distinct Screening Hits. J Med Chem60:2562-2572 (2017) 
 
Sphingosine kinase 1
Name:Sphingosine kinase 1
Type:Enzyme
Mol. Mass.:42521.16
Organism:Homo sapiens (Human)
Description:Q9NYA1
Residue:384
BDBM50237423
NameBDBM50237423
Synonyms:CHEMBL4104017
TypeSmall organic molecule
Emp. Form.C22H25N3O3
Mol. Mass.379.4522
SMILESCc1nc(no1)-c1cccc(OCc2ccc(CN3CCC[C@@H]3CO)cc2)c1