Reaction Details
TargetP2Y purinoceptor 4
LigandBDBM50336771
Substrate/Competitorn/a
Meas. Tech.ChEMBL_1661636 (CHEMBL4011248)
IC50 4040±n/a nM
Citation Rafehi, MMalik, EMNeumann, AAbdelrahman, AHanck, TNamasivayam, VMüller, CEBaqi, Y Development of Potent and Selective Antagonists for the UTP-Activated P2Y J Med Chem60:3020-3038 (2017) 
 
P2Y purinoceptor 4
Name:P2Y purinoceptor 4
Type:PROTEIN
Mol. Mass.:40977.17
Organism:Homo sapiens (Human)
Description:ChEMBL_751027
Residue:365
BDBM50336771
NameBDBM50336771
Synonyms:CHEMBL604158 | sodium 1-amino-4-(4-fluorophenylamino)-9,10-dioxo-9,10-dihydroanthracene-2-sulfonate
TypeSmall organic molecule
Emp. Form.C20H12FN2O5S
Mol. Mass.411.384
SMILESNc1c(cc(Nc2ccc(F)cc2)c2C(=O)c3ccccc3C(=O)c12)S([O-])(=O)=O