Reaction Details
TargetP2X purinoceptor 7
LigandBDBM50237713
Substrate/Competitorn/a
Meas. Tech.ChEMBL_1662362 (CHEMBL4012043)
IC50 132±n/a nM
Citation O'Brien-Brown, JJackson, AReekie, TABarron, MLWerry, ELSchiavini, PMcDonnell, MMunoz, LWilkinson, SNoll, BWang, SKassiou, M Discovery and pharmacological evaluation of a novel series of adamantyl cyanoguanidines as P2X Eur J Med Chem130:433-439 (2017) 
 
P2X purinoceptor 7
Name:P2X purinoceptor 7
Type:Protein
Mol. Mass.:68602.85
Organism:Homo sapiens (Human)
Description:Q99572
Residue:595
BDBM50237713
NameBDBM50237713
Synonyms:CHEMBL4071699
TypeSmall organic molecule
Emp. Form.C20H25FN4
Mol. Mass.340.4377
SMILESFc1cccc(CN\C(NCC23CC4CC(CC(C4)C2)C3)=N\C#N)c1