Reaction Details
TargetP2X purinoceptor 7
LigandBDBM50237730
Substrate/Competitorn/a
Meas. Tech.ChEBML_1662405
IC50 18±n/a nM
Citation O'Brien-Brown, JJackson, AReekie, TABarron, MLWerry, ELSchiavini, PMcDonnell, MMunoz, LWilkinson, SNoll, BWang, SKassiou, M Discovery and pharmacological evaluation of a novel series of adamantyl cyanoguanidines as P2X Eur J Med Chem130:433-439 (2017) 
 
P2X purinoceptor 7
Name:P2X purinoceptor 7
Type:Protein
Mol. Mass.:68602.85
Organism:Homo sapiens (Human)
Description:Q99572
Residue:595
BDBM50237730
NameBDBM50237730
Synonyms:CHEMBL4074449
TypeSmall organic molecule
Emp. Form.C22H25N5
Mol. Mass.359.4674
SMILESN#C\N=C(/NCC12CC3CC(CC(C3)C1)C2)Nc1cccc2ncccc12