Reaction Details
TargetAdenosine receptor A2a
LigandBDBM50237784
Substrate/Competitorn/a
Meas. Tech.ChEMBL_1661883 (CHEMBL4011495)
Ki 1080±n/a nM
Citation Yu, JZhao, LXPark, JLee, HWSahu, PKCui, MMoss, SMHammes, EWarnick, EGao, ZGNoh, MChoi, SAhn, HCChoi, JJacobson, KAJeong, LS N J Med Chem60:3422-3437 (2017) 
 
Adenosine receptor A2a
Name:Adenosine receptor A2a
Type:G Protein-Coupled Receptor (GPCR)
Mol. Mass.:44716.46
Organism:Homo sapiens (Human)
Description:P29274
Residue:412
BDBM50237784
NameBDBM50237784
Synonyms:CHEMBL4088081
TypeSmall organic molecule
Emp. Form.C18H19IN6O3Se
Mol. Mass.573.25
SMILESCNC(=O)[C@H]1[Se][C@H]([C@H](O)[C@@H]1O)n1cnc2c(NCc3cccc(I)c3)ncnc12