Reaction Details
TargetAdenosine receptor A1
LigandBDBM50237789
Substrate/Competitorn/a
Meas. Tech.ChEMBL_1661882 (CHEMBL4011494)
Ki 440±n/a nM
Citation Yu, JZhao, LXPark, JLee, HWSahu, PKCui, MMoss, SMHammes, EWarnick, EGao, ZGNoh, MChoi, SAhn, HCChoi, JJacobson, KAJeong, LS N J Med Chem60:3422-3437 (2017) 
 
Adenosine receptor A1
Name:Adenosine receptor A1
Type:G Protein-Coupled Receptor (GPCR)
Mol. Mass.:36520.92
Organism:Homo sapiens (Human)
Description:P30542
Residue:326
BDBM50237789
NameBDBM50237789
Synonyms:CHEMBL4103146
TypeSmall organic molecule
Emp. Form.C22H22N6O3Se
Mol. Mass.497.41
SMILESCNC(=O)[C@H]1[Se][C@H]([C@H](O)[C@@H]1O)n1cnc2c(NCc3ccc4ccccc4c3)ncnc12