Reaction Details
TargetSodium channel protein type 9 subunit alpha
LigandBDBM154245
Substrate/Competitorn/a
Meas. Tech.ChEBML_1662556
IC50 160±n/a nM
Citation Weiss, MMDineen, TAMarx, IEAltmann, SBoezio, ABregman, HChu-Moyer, MDiMauro, EFFeric Bojic, EFoti, RSGao, HGraceffa, RGunaydin, HGuzman-Perez, AHuang, HHuang, LJarosh, MKornecook, TKreiman, CRLigutti, JLa, DSLin, MJLiu, DMoyer, BDNguyen, HNPeterson, EARose, PETaborn, KYoungblood, BDYu, VFremeau, RT Sulfonamides as Selective Na J Med Chem60:5969-5989 (2017) 
 
Sodium channel protein type 9 subunit alpha
Name:Sodium channel protein type 9 subunit alpha
Type:Protein
Mol. Mass.:226375.97
Organism:Homo sapiens (Human)
Description:Q15858
Residue:1988
BDBM154245
NameBDBM154245
Synonyms:US9012443, 261
TypeSmall organic molecule
Emp. Form.C19H13F3N4O3S2
Mol. Mass.466.457
SMILESCOc1cc(ccc1-c1ncnc2cc(ccc12)S(=O)(=O)Nc1nccs1)C(F)(F)F