Reaction Details
TargetCytochrome P450 3A4
LigandBDBM342895
Substrate/Competitorn/a
Meas. Tech.ChEMBL_1662545 (CHEMBL4012226)
IC50>27000±n/a nM
Citation Weiss, MMDineen, TAMarx, IEAltmann, SBoezio, ABregman, HChu-Moyer, MDiMauro, EFFeric Bojic, EFoti, RSGao, HGraceffa, RGunaydin, HGuzman-Perez, AHuang, HHuang, LJarosh, MKornecook, TKreiman, CRLigutti, JLa, DSLin, MJLiu, DMoyer, BDNguyen, HNPeterson, EARose, PETaborn, KYoungblood, BDYu, VFremeau, RT Sulfonamides as Selective Na J Med Chem60:5969-5989 (2017) 
 
Cytochrome P450 3A4
Name:Cytochrome P450 3A4
Type:Enzyme
Mol. Mass.:57349.57
Organism:Homo sapiens (Human)
Description:n/a
Residue:503
BDBM342895
NameBDBM342895
Synonyms:1-(2-chloro-3'-fluoro-5-methoxy-4-biphenylyl)-N-2-pyrimidinyl-6-isoquinolinesulfonamide | US9776995, Example 108
TypeSmall organic molecule
Emp. Form.C26H18ClFN4O3S
Mol. Mass.520.963
SMILESCOc1cc(c(Cl)cc1-c1nccc2cc(ccc12)S(=O)(=O)Nc1ncccn1)-c1cccc(F)c1