Reaction Details
TargetSodium channel protein type 9 subunit alpha
LigandBDBM343157
Substrate/Competitorn/a
Meas. Tech.ChEMBL_1662556 (CHEMBL4012237)
IC50 41±n/a nM
Citation Weiss, MMDineen, TAMarx, IEAltmann, SBoezio, ABregman, HChu-Moyer, MDiMauro, EFFeric Bojic, EFoti, RSGao, HGraceffa, RGunaydin, HGuzman-Perez, AHuang, HHuang, LJarosh, MKornecook, TKreiman, CRLigutti, JLa, DSLin, MJLiu, DMoyer, BDNguyen, HNPeterson, EARose, PETaborn, KYoungblood, BDYu, VFremeau, RT Sulfonamides as Selective Na J Med Chem60:5969-5989 (2017) 
 
Sodium channel protein type 9 subunit alpha
Name:Sodium channel protein type 9 subunit alpha
Type:Protein
Mol. Mass.:226375.97
Organism:Homo sapiens (Human)
Description:Q15858
Residue:1988
BDBM343157
NameBDBM343157
Synonyms:1-(2-chloro-3'-fluoro-5-methoxy-4-biphenylyl)-N-3-isoxazolyl-3-oxo-2,3-dihydro-6-isoquinolinesulfonamide | US9776995, Example 394
TypeSmall organic molecule
Emp. Form.C25H17ClFN3O5S
Mol. Mass.525.936
SMILESCOc1cc(c(Cl)cc1-c1[nH]c(=O)cc2cc(ccc12)S(=O)(=O)Nc1ccon1)-c1cccc(F)c1