Reaction Details
TargetSodium channel protein type 5 subunit alpha
LigandBDBM343082
Substrate/Competitorn/a
Meas. Tech.ChEMBL_1662520 (CHEMBL4012201)
IC50>10000±n/a nM
Citation Weiss, MMDineen, TAMarx, IEAltmann, SBoezio, ABregman, HChu-Moyer, MDiMauro, EFFeric Bojic, EFoti, RSGao, HGraceffa, RGunaydin, HGuzman-Perez, AHuang, HHuang, LJarosh, MKornecook, TKreiman, CRLigutti, JLa, DSLin, MJLiu, DMoyer, BDNguyen, HNPeterson, EARose, PETaborn, KYoungblood, BDYu, VFremeau, RT Sulfonamides as Selective Na J Med Chem60:5969-5989 (2017) 
 
Sodium channel protein type 5 subunit alpha
Name:Sodium channel protein type 5 subunit alpha
Type:Enzyme
Mol. Mass.:226908.60
Organism:Homo sapiens (Human)
Description:Q14524
Residue:2016
BDBM343082
NameBDBM343082
Synonyms:1-(2-chloro-3'-fluoro-5-methoxy-4-biphenylyl)-N-1,3-oxazol-2-yl-6-isoquinolinesulfonamide | US9776995, Example 257
TypeSmall organic molecule
Emp. Form.C25H17ClFN3O4S
Mol. Mass.509.937
SMILESCOc1cc(c(Cl)cc1-c1nccc2cc(ccc12)S(=O)(=O)Nc1ncco1)-c1cccc(F)c1