Reaction Details
TargetSodium channel protein type 9 subunit alpha
LigandBDBM343163
Substrate/Competitorn/a
Meas. Tech.ChEMBL_1662556 (CHEMBL4012237)
IC50 39±n/a nM
Citation Weiss, MMDineen, TAMarx, IEAltmann, SBoezio, ABregman, HChu-Moyer, MDiMauro, EFFeric Bojic, EFoti, RSGao, HGraceffa, RGunaydin, HGuzman-Perez, AHuang, HHuang, LJarosh, MKornecook, TKreiman, CRLigutti, JLa, DSLin, MJLiu, DMoyer, BDNguyen, HNPeterson, EARose, PETaborn, KYoungblood, BDYu, VFremeau, RT Sulfonamides as Selective Na J Med Chem60:5969-5989 (2017) 
 
Sodium channel protein type 9 subunit alpha
Name:Sodium channel protein type 9 subunit alpha
Type:Protein
Mol. Mass.:226375.97
Organism:Homo sapiens (Human)
Description:Q15858
Residue:1988
BDBM343163
NameBDBM343163
Synonyms:4-(2-chloro-3'-fluoro-5-methoxy-4-biphenylyl)-N-3-isoxazolyl-2-methyl-3-oxo-2,3-dihydro-7-isoquinolinesulfonamide | US9776995, Example 402
TypeSmall organic molecule
Emp. Form.C26H19ClFN3O5S
Mol. Mass.539.963
SMILESCOc1cc(c(Cl)cc1-c1c2ccc(cc2cn(C)c1=O)S(=O)(=O)Nc1ccon1)-c1cccc(F)c1