Reaction Details
TargetSodium channel protein type 5 subunit alpha
LigandBDBM154311
Substrate/Competitorn/a
Meas. Tech.ChEMBL_1662520 (CHEMBL4012201)
IC50 1500±n/a nM
Citation Weiss, MMDineen, TAMarx, IEAltmann, SBoezio, ABregman, HChu-Moyer, MDiMauro, EFFeric Bojic, EFoti, RSGao, HGraceffa, RGunaydin, HGuzman-Perez, AHuang, HHuang, LJarosh, MKornecook, TKreiman, CRLigutti, JLa, DSLin, MJLiu, DMoyer, BDNguyen, HNPeterson, EARose, PETaborn, KYoungblood, BDYu, VFremeau, RT Sulfonamides as Selective Na J Med Chem60:5969-5989 (2017) 
 
Sodium channel protein type 5 subunit alpha
Name:Sodium channel protein type 5 subunit alpha
Type:Enzyme
Mol. Mass.:226908.60
Organism:Homo sapiens (Human)
Description:Q14524
Residue:2016
BDBM154311
NameBDBM154311
Synonyms:US9012443, 331
TypeSmall organic molecule
Emp. Form.C24H16ClFN4O3S2
Mol. Mass.526.99
SMILESCOc1cc(c(Cl)cc1-c1nccc2cc(ccc12)S(=O)(=O)Nc1ncns1)-c1cccc(F)c1