Reaction Details
TargetSodium channel protein type 9 subunit alpha
LigandBDBM343208
Substrate/Competitorn/a
Meas. Tech.ChEMBL_1662556 (CHEMBL4012237)
IC50 28±n/a nM
Citation Weiss, MMDineen, TAMarx, IEAltmann, SBoezio, ABregman, HChu-Moyer, MDiMauro, EFFeric Bojic, EFoti, RSGao, HGraceffa, RGunaydin, HGuzman-Perez, AHuang, HHuang, LJarosh, MKornecook, TKreiman, CRLigutti, JLa, DSLin, MJLiu, DMoyer, BDNguyen, HNPeterson, EARose, PETaborn, KYoungblood, BDYu, VFremeau, RT Sulfonamides as Selective Na J Med Chem60:5969-5989 (2017) 
 
Sodium channel protein type 9 subunit alpha
Name:Sodium channel protein type 9 subunit alpha
Type:Protein
Mol. Mass.:226375.97
Organism:Homo sapiens (Human)
Description:Q15858
Residue:1988
BDBM343208
NameBDBM343208
Synonyms:3-amino-4-(2-chloro-3'-fluoro-5-methoxy-4-biphenylyl)-N-3-isoxazolyl-7-cinnolinesulfonamide | US9776995, Example 446
TypeSmall organic molecule
Emp. Form.C24H17ClFN5O4S
Mol. Mass.525.939
SMILESCOc1cc(c(Cl)cc1-c1c(N)nnc2cc(ccc12)S(=O)(=O)Nc1ccon1)-c1cccc(F)c1