Reaction Details
TargetGeranylgeranyl pyrophosphate synthase
LigandBDBM50237986
Substrate/Competitorn/a
Meas. Tech.ChEMBL_1662613 (CHEMBL4012294)
IC50 2600±n/a nM
Citation Wills, VSMetzger, JIAllen, CVarney, MLWiemer, DFHolstein, SA Bishomoisoprenoid triazole bisphosphonates as inhibitors of geranylgeranyl diphosphate synthase. Bioorg Med Chem25:2437-2444 (2017) 
 
Geranylgeranyl pyrophosphate synthase
Name:Geranylgeranyl pyrophosphate synthase
Type:Homooctamer; transferase
Mol. Mass.:34867.94
Organism:Homo sapiens (Human)
Description:Recombinant human GGPPS was cloned and expressed in E. coli.
Residue:300
BDBM50237986
NameBDBM50237986
Synonyms:CHEMBL4078024
TypeSmall organic molecule
Emp. Form.C16H25N3Na4O6P2
Mol. Mass.509.2928
SMILES[Na+].[Na+].[Na+].[Na+].[#6]\[#6](-[#6])=[#6]\[#6]-[#6]\[#6](-[#6])=[#6]\[#6]-[#6]-[#6]-n1cc(-[#6]-[#6](P([#8-])([#8-])=O)P([#8-])([#8-])=O)nn1