Reaction Details
TargetBromodomain-containing protein 4
LigandBDBM188517
Substrate/Competitorn/a
Meas. Tech.ChEBML_1662832
IC50 18100±n/a nM
Citation Denny, RAFlick, ACCoe, JLangille, JBasak, ALiu, SStock, ISahasrabudhe, PBonin, PHay, DABrennan, PEPletcher, MJones, LHChekler, ELP Structure-Based Design of Highly Selective Inhibitors of the CREB Binding Protein Bromodomain. J Med Chem60:5349-5363 (2017) 
 
Bromodomain-containing protein 4
Name:Bromodomain-containing protein 4
Type:Protein
Mol. Mass.:152264.84
Organism:Homo sapiens (Human)
Description:O60885
Residue:1362
BDBM188517
NameBDBM188517
Synonyms:PF-CBP1
TypeSmall organic molecule
Emp. Form.C29H36N4O3
Mol. Mass.488.6211
SMILESCCCOc1ccc(CCc2nc3cc(ccc3n2CCN2CCOCC2)-c2c(C)noc2C)cc1