Reaction Details
TargetA disintegrin and metalloproteinase with thrombospondin motifs 5
LigandBDBM50238241
Substrate/Competitorn/a
Meas. Tech.ChEMBL_1663585 (CHEMBL4013266)
IC50 52±n/a nM
Citation Durham, TBMarimuthu, JToth, JLLiu, CAdams, LMudra, DRSwearingen, CLin, CChambers, MGThirunavukkarasu, KWiley, MR A Highly Selective Hydantoin Inhibitor of Aggrecanase-1 and Aggrecanase-2 with a Low Projected Human Dose. J Med Chem60:5933-5939 (2017) 
 
A disintegrin and metalloproteinase with thrombospondin motifs 5
Name:A disintegrin and metalloproteinase with thrombospondin motifs 5
Type:Enzyme
Mol. Mass.:101769.09
Organism:Homo sapiens (Human)
Description:Q9UNA0
Residue:930
BDBM50238241
NameBDBM50238241
Synonyms:CHEMBL4102193
TypeSmall organic molecule
Emp. Form.C17H18F3N3O3
Mol. Mass.369.3383
SMILESFC(F)(F)c1ccc(CCC(=O)NC[C@]2(NC(=O)NC2=O)C2CC2)cc1