Reaction Details
TargetPoly [ADP-ribose] polymerase tankyrase-1
LigandBDBM50238426
Substrate/Competitorn/a
Meas. Tech.ChEMBL_1663210 (CHEMBL4012891)
IC50 200±n/a nM
Citation Thomson, DWWagner, AJBantscheff, MBenson, REDittus, LDuempelfeld, BDrewes, GKrause, JMoore, JTMueller, KPoeckel, DRau, CSalzer, EShewchuk, LHopf, CEmery, JGMuelbaier, M Discovery of a Highly Selective Tankyrase Inhibitor Displaying Growth Inhibition Effects against a Diverse Range of Tumor Derived Cell Lines. J Med Chem60:5455-5471 (2017) 
 
Poly [ADP-ribose] polymerase tankyrase-1
Name:Poly [ADP-ribose] polymerase tankyrase-1
Type:Enzyme
Mol. Mass.:142058.03
Organism:Homo sapiens (Human)
Description:O95271
Residue:1327
BDBM50238426
NameBDBM50238426
Synonyms:CHEMBL4068660
TypeSmall organic molecule
Emp. Form.C18H17N7O2
Mol. Mass.363.3733
SMILESCOCCNC(=O)c1ccc(Nc2nc3ccccc3n3nnnc23)cc1