Reaction Details
TargetPoly [ADP-ribose] polymerase 2
LigandBDBM50238428
Substrate/Competitorn/a
Meas. Tech.ChEMBL_1663204 (CHEMBL4012885)
IC50<5012±n/a nM
Citation Thomson, DWWagner, AJBantscheff, MBenson, REDittus, LDuempelfeld, BDrewes, GKrause, JMoore, JTMueller, KPoeckel, DRau, CSalzer, EShewchuk, LHopf, CEmery, JGMuelbaier, M Discovery of a Highly Selective Tankyrase Inhibitor Displaying Growth Inhibition Effects against a Diverse Range of Tumor Derived Cell Lines. J Med Chem60:5455-5471 (2017) 
 
Poly [ADP-ribose] polymerase 2
Name:Poly [ADP-ribose] polymerase 2
Type:Enzyme
Mol. Mass.:66225.70
Organism:Homo sapiens (Human)
Description:Q9UGN5
Residue:583
BDBM50238428
NameBDBM50238428
Synonyms:CHEMBL4087876
TypeSmall organic molecule
Emp. Form.C19H17N7O2
Mol. Mass.375.384
SMILESO=C(N1CCOCC1)c1ccc(Nc2nc3ccccc3n3nnnc23)cc1