Reaction Details
TargetPoly [ADP-ribose] polymerase 1
LigandBDBM50238416
Substrate/Competitorn/a
Meas. Tech.ChEMBL_1663203 (CHEMBL4012884)
IC50<5012±n/a nM
Citation Thomson, DWWagner, AJBantscheff, MBenson, REDittus, LDuempelfeld, BDrewes, GKrause, JMoore, JTMueller, KPoeckel, DRau, CSalzer, EShewchuk, LHopf, CEmery, JGMuelbaier, M Discovery of a Highly Selective Tankyrase Inhibitor Displaying Growth Inhibition Effects against a Diverse Range of Tumor Derived Cell Lines. J Med Chem60:5455-5471 (2017) 
 
Poly [ADP-ribose] polymerase 1
Name:Poly [ADP-ribose] polymerase 1
Type:n/a
Mol. Mass.:113114.22
Organism:Homo sapiens (Human)
Description:P09874
Residue:1014
BDBM50238416
NameBDBM50238416
Synonyms:CHEMBL4087470
TypeSmall organic molecule
Emp. Form.C23H20N10O
Mol. Mass.452.4713
SMILESO=C(N1CCN(CC1)c1ncccn1)c1ccc(Nc2nc3ccccc3n3nnnc23)cc1